Reaction Details
TargetAndrogen receptor
LigandBDBM142640
Substrate/Competitorn/a
Meas. Tech.Binding Assay
IC50 43±n/a nM
Citation Klar, UKuhnke, JBohlmann, RHübner, JRing, SFrenzel, TMenges, FBorden, SMuhn, HPrelle, K 17-hydroxy-19-nor-21-carboxylic acid-steroid γ-lactone derivative, use thereof, and medicament containing the derivative US Patent US8937058 Publication Date 1/20/2015
 
Androgen receptor
Name:Androgen receptor
Type:Receptor
Mol. Mass.:99185.27
Organism:Homo sapiens (Human)
Description:CHO cells were stably transfected with human AR gene.
Residue:920
BDBM142640
NameBDBM142640
Synonyms:US8937058, 8A
TypeSmall organic molecule
Emp. Form.C23H30O3
Mol. Mass.354.4825
SMILESCC[C@]12CC[C@@H]3[C@H]4CCC(=O)C=C4C[C@@H](C)[C@H]3[C@@H]1CC[C@]21OC(=O)C=C1