Reaction Details
TargetTyrosine-protein kinase JAK1
LigandBDBM100350
Substrate/Competitorn/a
Meas. Tech.Time-Resolved Fluorescence Resonance Energy Transfer Assay (TR-FRET)
IC50 6.7±n/a nM
Citation Bauer, SMPandey, A Inhibitors of protein kinases US Patent US8937070 Publication Date 1/20/2015
 
Tyrosine-protein kinase JAK1
Name:Tyrosine-protein kinase JAK1
Type:Protein
Mol. Mass.:133293.73
Organism:Homo sapiens (Human)
Description:P23458
Residue:1154
BDBM100350
NameBDBM100350
Synonyms:US10533001, Example 99 US8501944, 372 US9868729, Example 99
TypeSmall organic molecule
Emp. Form.C19H25N7O3S
Mol. Mass.431.512
SMILESCS(=O)(=O)N1CCN(CC1)c1ccc(Nc2ncc(C(N)=O)c(NC3CC3)n2)cc1