Reaction Details
TargetBeta-secretase 2
LigandBDBM143223
Substrate/Competitorn/a
Meas. Tech.HTRF assay
pH5±n/a
Temperature303.15±n/a K
Ki 0.45±n/a nM
Commentsextracted
Citation Scott, JDStamford, AWGilbert, EJCumming, JNIserloh, U Iminothiadiazine dioxide compounds as BACE inhibitors, compositions, and their use US Patent US8940748 Publication Date 1/27/2015
 
Beta-secretase 2
Name:Beta-secretase 2
Type:Protein
Mol. Mass.:56171.20
Organism:Homo sapiens (Human)
Description:Q9Y5Z0
Residue:518
BDBM143223
NameBDBM143223
Synonyms:US8940748, 35 US9687494, 35
TypeSmall organic molecule
Emp. Form.C18H20FN5O3S
Mol. Mass.405.447
SMILESCN1C(=N)N[C@@](C)(CS1(=O)=O)c1cc(NC(=O)c2ccc(C)cn2)ccc1F