Reaction Details
TargetBeta-secretase 2
LigandBDBM143227
Substrate/Competitorn/a
Meas. Tech.HTRF assay
pH5±n/a
Temperature303.15±n/a K
Ki 0.37±n/a nM
Commentsextracted
Citation Scott, JDStamford, AWGilbert, EJCumming, JNIserloh, U Iminothiadiazine dioxide compounds as BACE inhibitors, compositions, and their use US Patent US8940748 Publication Date 1/27/2015
 
Beta-secretase 2
Name:Beta-secretase 2
Type:Protein
Mol. Mass.:56171.20
Organism:Homo sapiens (Human)
Description:Q9Y5Z0
Residue:518
BDBM143227
NameBDBM143227
Synonyms:US8940748, 52 US9687494, 52
TypeSmall organic molecule
Emp. Form.C17H17ClN4O2S2
Mol. Mass.408.925
SMILESCC#Cc1cncc(c1)-c1cc(Cl)c(s1)[C@]1(C)CS(=O)(=O)N(C)C(=N)N1