Reaction Details
TargetTransient receptor potential cation channel subfamily V member 1
LigandBDBM143833
Substrate/Competitorn/a
Meas. Tech.Activation Assay
IC50 7±n/a nM
Citation Dart, MJKym, PRVoight, EAShrestha, ADaanen, JFJinkerson, TKKeddy, RGPeddi, SGomtsyan, AKort, MEGfesser, GAWoller, KRNelson, DW TRPV1 antagonists US Patent US8969325 Publication Date 3/3/2015
 
Transient receptor potential cation channel subfamily V member 1
Name:Transient receptor potential cation channel subfamily V member 1
Type:Protein
Mol. Mass.:94960.75
Organism:Homo sapiens (Human)
Description:Q8NER1
Residue:839
BDBM143833
NameBDBM143833
Synonyms:US8969325, 34
TypeSmall organic molecule
Emp. Form.C21H20F3N3O3
Mol. Mass.419.397
SMILESC[C@@]1(C[C@@H](NC(=O)Nc2ccc3CCC(=O)Nc3c2)c2ccccc2O1)C(F)(F)F