Reaction Details
TargetProstaglandin E synthase
LigandBDBM286034
Substrate/Competitorn/a
Meas. Tech.mPGES1 enzyme assay
IC50 2.68±n/a nM
Citation Li, XHe, WLiu, XWang, BHu, QJin, FDong, QSun, P Amide derivatives and pharmaceutically acceptable salts thereof, preparation method thereof and medicinal application thereof US Patent US10081629 Publication Date 9/25/2018
 
Prostaglandin E synthase
Name:Prostaglandin E synthase
Type:Protein
Mol. Mass.:17112.22
Organism:Homo sapiens (Human)
Description:n/a
Residue:152
BDBM286034
NameBDBM286034
Synonyms:2-(Difluoromethyl)-N-(1-ethyl-2-(4-(trifluoromethyl)phenyl)-1H-indol-5-yl)-5-(((2-fluoro-2-methyl-propanoyl)amino)methyl)nicotinamide | US10081629, Example 17
TypeSmall organic molecule
Emp. Form.C22H23F3N4O2
Mol. Mass.432.4388
SMILESCCn1ccc2cc(NC(=O)c3cc(CNC(=O)C(C)(C)F)cnc3C(F)F)ccc12