Reaction Details
TargetProto-oncogene tyrosine-protein kinase ROS
LigandBDBM144327
Substrate/Competitorn/a
Meas. Tech.Inhibition Assay
IC50 0.86±n/a nM
Citation Shimada, IKurosawa, KMatsuya, TIikubo, KKondoh, YKamikawa, ATomiyama, HIwai, Y Diamino heterocyclic carboxamide compound US Patent US8969336 Publication Date 3/3/2015
 
Proto-oncogene tyrosine-protein kinase ROS
Name:Proto-oncogene tyrosine-protein kinase ROS
Type:Enzyme
Mol. Mass.:263897.39
Organism:Homo sapiens (Human)
Description:P08922
Residue:2347
BDBM144327
NameBDBM144327
Synonyms:US8969336, 571
TypeSmall organic molecule
Emp. Form.C31H48N8O2
Mol. Mass.564.7652
SMILESCCc1nc(C(N)=O)c(Nc2ccc(N3CCC(CC3)N3CCN(C)CC3)c(C)c2)nc1N[C@H]1CC[C@@](C)(O)CC1