Reaction Details
TargetProto-oncogene tyrosine-protein kinase ROS
LigandBDBM144315
Substrate/Competitorn/a
Meas. Tech.Inhibition Assay
IC50 1.9±n/a nM
Citation Shimada, IKurosawa, KMatsuya, TIikubo, KKondoh, YKamikawa, ATomiyama, HIwai, Y Diamino heterocyclic carboxamide compound US Patent US8969336 Publication Date 3/3/2015
 
Proto-oncogene tyrosine-protein kinase ROS
Name:Proto-oncogene tyrosine-protein kinase ROS
Type:Enzyme
Mol. Mass.:263897.39
Organism:Homo sapiens (Human)
Description:P08922
Residue:2347
BDBM144315
NameBDBM144315
Synonyms:Gilteritinib US8969336, 547 | US8969336, 577
TypeSmall organic molecule
Emp. Form.C29H44N8O3
Mol. Mass.552.7115
SMILESCCc1nc(C(N)=O)c(Nc2ccc(N3CCC(CC3)N3CCN(C)CC3)c(OC)c2)nc1NC1CCOCC1