Reaction Details
TargetProstaglandin E2 receptor EP4 subtype
LigandBDBM144433
Substrate/Competitorn/a
Meas. Tech.Binding Assay
pH6±n/a
Temperature298.15±n/a K
Ki 0.47±n/a nM
Commentsextracted
Citation Blouin, MBurch, JHan, YMellon, C Thiophenecarboxamide derivatives as EP4 receptor ligands US Patent US8969394 Publication Date 3/3/2015
 
Prostaglandin E2 receptor EP4 subtype
Name:Prostaglandin E2 receptor EP4 subtype
Type:Enzyme
Mol. Mass.:53134.53
Organism:Homo sapiens (Human)
Description:P35408
Residue:488
BDBM144433
NameBDBM144433
Synonyms:US8969394, 5
TypeSmall organic molecule
Emp. Form.C21H16Br2ClNO3S
Mol. Mass.557.683
SMILESC[C@H](NC(=O)c1c(Br)sc(Br)c1Cc1cccc(Cl)c1)c1ccc(cc1)C(O)=O