Reaction Details
TargetProstaglandin E2 receptor EP4 subtype
LigandBDBM50308127
Substrate/Competitorn/a
Meas. Tech.Binding Assay
pH6±n/a
Temperature298.15±n/a K
Ki 2.4±n/a nM
Commentsextracted
Citation Blouin, MBurch, JHan, YMellon, C Thiophenecarboxamide derivatives as EP4 receptor ligands US Patent US8969394 Publication Date 3/3/2015
 
Prostaglandin E2 receptor EP4 subtype
Name:Prostaglandin E2 receptor EP4 subtype
Type:Enzyme
Mol. Mass.:53134.53
Organism:Homo sapiens (Human)
Description:P35408
Residue:488
BDBM50308127
NameBDBM50308127
Synonyms:4-{(1S)-1-[({2,5-Dimethyl-4-[3-(trifluoromethyl)benzyl]-3-thienyl}carbonyl)amino]ethyl}benzoic Acid | CHEMBL605330
TypeSmall organic molecule
Emp. Form.C24H22F3NO3S
Mol. Mass.461.497
SMILESC[C@H](NC(=O)c1c(C)sc(C)c1Cc1cccc(c1)C(F)(F)F)c1ccc(cc1)C(O)=O