Reaction Details
TargetProstaglandin E2 receptor EP4 subtype
LigandBDBM50308128
Substrate/Competitorn/a
Meas. Tech.Binding Assay
pH6±n/a
Temperature298.15±n/a K
Ki 3.4±n/a nM
Commentsextracted
Citation Blouin, MBurch, JHan, YMellon, C Thiophenecarboxamide derivatives as EP4 receptor ligands US Patent US8969394 Publication Date 3/3/2015
 
Prostaglandin E2 receptor EP4 subtype
Name:Prostaglandin E2 receptor EP4 subtype
Type:Enzyme
Mol. Mass.:53134.53
Organism:Homo sapiens (Human)
Description:P35408
Residue:488
BDBM50308128
NameBDBM50308128
Synonyms:4-[(1S)-1-({[4-(4-Chlorobenzyl)-2,5-dimethyl-3-thienyl]carbonyl}-amino)ethyl]benzoicAcid | CHEMBL599262
TypeSmall organic molecule
Emp. Form.C23H22ClNO3S
Mol. Mass.427.944
SMILESC[C@H](NC(=O)c1c(C)sc(C)c1Cc1ccc(Cl)cc1)c1ccc(cc1)C(O)=O