Reaction Details
TargetTyrosine-protein kinase SYK
LigandBDBM144483
Substrate/Competitorn/a
Meas. Tech.Kinase Glo Luminescence Kinase Assay
IC50 0.2±n/a nM
Citation Hoffmann, MDahmann, GFiegen, DHandschuh, SKlicic, JLinz, GSchaenzle, GSchnapp, AEast, SPMazanetz, MPScott, RJWalker, E Substituted naphthyridines and their use as medicaments US Patent US8969568 Publication Date 3/3/2015
 
Tyrosine-protein kinase SYK
Name:Tyrosine-protein kinase SYK
Type:Enzyme
Mol. Mass.:72079.99
Organism:Homo sapiens (Human)
Description:P43405
Residue:635
BDBM144483
NameBDBM144483
Synonyms:US8969568, 35
TypeSmall organic molecule
Emp. Form.C23H25N3O5
Mol. Mass.423.4617
SMILESCOc1cc(cc(OC)c1OC)-c1cc2ncccc2c(O[C@H](C)[C@H]2CNC(=O)C2)n1