Reaction Details
TargetTyrosine-protein kinase SYK
LigandBDBM144493
Substrate/Competitorn/a
Meas. Tech.Kinase Glo Luminescence Kinase Assay
IC50 0.1±n/a nM
Citation Hoffmann, MDahmann, GFiegen, DHandschuh, SKlicic, JLinz, GSchaenzle, GSchnapp, AEast, SPMazanetz, MPScott, RJWalker, E Substituted naphthyridines and their use as medicaments US Patent US8969568 Publication Date 3/3/2015
 
Tyrosine-protein kinase SYK
Name:Tyrosine-protein kinase SYK
Type:Enzyme
Mol. Mass.:72079.99
Organism:Homo sapiens (Human)
Description:P43405
Residue:635
BDBM144493
NameBDBM144493
Synonyms:US8969568, 45
TypeSmall organic molecule
Emp. Form.C23H25N5O3
Mol. Mass.419.4763
SMILESC[C@@H](Oc1nc(cc2ncccc12)-c1ccc(nc1)N1CCOCC1)[C@H]1CNC(=O)C1