Reaction Details
TargetTyrosine-protein kinase SYK
LigandBDBM144498
Substrate/Competitorn/a
Meas. Tech.Kinase Glo Luminescence Kinase Assay
IC50 2.7±n/a nM
Citation Hoffmann, MDahmann, GFiegen, DHandschuh, SKlicic, JLinz, GSchaenzle, GSchnapp, AEast, SPMazanetz, MPScott, RJWalker, E Substituted naphthyridines and their use as medicaments US Patent US8969568 Publication Date 3/3/2015
 
Tyrosine-protein kinase SYK
Name:Tyrosine-protein kinase SYK
Type:Enzyme
Mol. Mass.:72079.99
Organism:Homo sapiens (Human)
Description:P43405
Residue:635
BDBM144498
NameBDBM144498
Synonyms:US8969568, 50
TypeSmall organic molecule
Emp. Form.C24H27N3O5
Mol. Mass.437.4883
SMILESCOC[C@H](C)Oc1ccc(cc1OC)-c1cc2ncccc2c(OC[C@H]2CNC(=O)C2)n1