Reaction Details
TargetTyrosine-protein kinase SYK
LigandBDBM144512
Substrate/Competitorn/a
Meas. Tech.Kinase Glo Luminescence Kinase Assay
IC50 0.1±n/a nM
Citation Hoffmann, MDahmann, GFiegen, DHandschuh, SKlicic, JLinz, GSchaenzle, GSchnapp, AEast, SPMazanetz, MPScott, RJWalker, E Substituted naphthyridines and their use as medicaments US Patent US8969568 Publication Date 3/3/2015
 
Tyrosine-protein kinase SYK
Name:Tyrosine-protein kinase SYK
Type:Enzyme
Mol. Mass.:72079.99
Organism:Homo sapiens (Human)
Description:P43405
Residue:635
BDBM144512
NameBDBM144512
Synonyms:US8969568, 65
TypeSmall organic molecule
Emp. Form.C27H31N3O5
Mol. Mass.477.5521
SMILESCC[C@@H](Oc1nc(cc2ncccc12)-c1ccc(OC2CCOCC2)c(OC)c1)[C@H]1CNC(=O)C1