Reaction Details
TargetTyrosine-protein kinase SYK
LigandBDBM144504
Substrate/Competitorn/a
Meas. Tech.Kinase Glo Luminescence Kinase Assay
IC50 20.4±n/a nM
Citation Hoffmann, MDahmann, GFiegen, DHandschuh, SKlicic, JLinz, GSchaenzle, GSchnapp, AEast, SPMazanetz, MPScott, RJWalker, E Substituted naphthyridines and their use as medicaments US Patent US8969568 Publication Date 3/3/2015
 
Tyrosine-protein kinase SYK
Name:Tyrosine-protein kinase SYK
Type:Enzyme
Mol. Mass.:72079.99
Organism:Homo sapiens (Human)
Description:P43405
Residue:635
BDBM144504
NameBDBM144504
Synonyms:US8969568, 103 US8969568, 105 US8969568, 109 US8969568, 114 US8969568, 57
TypeSmall organic molecule
Emp. Form.C14H15N3O2
Mol. Mass.257.2878
SMILESCc1cc2ncccc2c(OC[C@H]2CNC(=O)C2)n1