Reaction Details
TargetSignal transducer and activator of transcription 3
LigandBDBM144576
Substrate/Competitorn/a
Meas. Tech. EMSA Based Assay
IC50>1000000±n/a nM
Citation Turkson, JHamilton, AD Inhibitors of STAT3 US Patent US8969578 Publication Date 3/3/2015
 
Signal transducer and activator of transcription 3
Name:Signal transducer and activator of transcription 3
Type:Protein
Mol. Mass.:88064.31
Organism:Homo sapiens (Human)
Description:P40763
Residue:770
BDBM144576
NameBDBM144576
Synonyms:US8969578, 8
TypeSmall organic molecule
Emp. Form.C23H27N2O6P
Mol. Mass.458.444
SMILESCCCCCCNC(=O)c1nc(oc1Cc1ccc(OP(O)(O)=O)cc1)-c1ccccc1