Reaction Details
TargetSignal transducer and activator of transcription 3
LigandBDBM144577
Substrate/Competitorn/a
Meas. Tech. EMSA Based Assay
IC50 150000±n/a nM
Citation Turkson, JHamilton, AD Inhibitors of STAT3 US Patent US8969578 Publication Date 3/3/2015
 
Signal transducer and activator of transcription 3
Name:Signal transducer and activator of transcription 3
Type:Protein
Mol. Mass.:88064.31
Organism:Homo sapiens (Human)
Description:P40763
Residue:770
BDBM144577
NameBDBM144577
Synonyms:US8969578, 9
TypeSmall organic molecule
Emp. Form.C23H27N2O5PS
Mol. Mass.474.51
SMILESCCCCCCNC(=O)c1nc(sc1Cc1ccc(OP(O)(O)=O)cc1)-c1ccccc1