Reaction Details
TargetSignal transducer and activator of transcription 3
LigandBDBM50396183
Substrate/Competitorn/a
Meas. Tech. EMSA Based Assay
IC50 33000±n/a nM
Citation Turkson, JHamilton, AD Inhibitors of STAT3 US Patent US8969578 Publication Date 3/3/2015
 
Signal transducer and activator of transcription 3
Name:Signal transducer and activator of transcription 3
Type:Protein
Mol. Mass.:88064.31
Organism:Homo sapiens (Human)
Description:P40763
Residue:770
BDBM50396183
NameBDBM50396183
Synonyms:CHEMBL2172015
TypeSmall organic molecule
Emp. Form.C29H29N2O6P
Mol. Mass.532.5241
SMILESOP(O)(=O)Oc1ccc(Cc2oc(nc2C(=O)Nc2ccc(cc2)C2CCCCC2)-c2ccccc2)cc1