Reaction Details
TargetSignal transducer and activator of transcription 3
LigandBDBM144578
Substrate/Competitorn/a
Meas. Tech. EMSA Based Assay
IC50 775000±n/a nM
Citation Turkson, JHamilton, AD Inhibitors of STAT3 US Patent US8969578 Publication Date 3/3/2015
 
Signal transducer and activator of transcription 3
Name:Signal transducer and activator of transcription 3
Type:Protein
Mol. Mass.:88064.31
Organism:Homo sapiens (Human)
Description:P40763
Residue:770
BDBM144578
NameBDBM144578
Synonyms:US8969578, 11
TypeSmall organic molecule
Emp. Form.C29H29N2O5PS
Mol. Mass.548.59
SMILESOP(O)(=O)Oc1ccc(Cc2sc(nc2C(=O)Nc2ccc(cc2)C2CCCCC2)-c2ccccc2)cc1