Reaction Details
TargetSignal transducer and activator of transcription 3
LigandBDBM144579
Substrate/Competitorn/a
Meas. Tech. EMSA Based Assay
IC50>1000000±n/a nM
Citation Turkson, JHamilton, AD Inhibitors of STAT3 US Patent US8969578 Publication Date 3/3/2015
 
Signal transducer and activator of transcription 3
Name:Signal transducer and activator of transcription 3
Type:Protein
Mol. Mass.:88064.31
Organism:Homo sapiens (Human)
Description:P40763
Residue:770
BDBM144579
NameBDBM144579
Synonyms:US8969578, 12
TypeSmall organic molecule
Emp. Form.C29H28N2O3
Mol. Mass.452.5442
SMILESOc1ccc(Cc2oc(nc2C(=O)Nc2ccc(cc2)C2CCCCC2)-c2ccccc2)cc1