Reaction Details
TargetSignal transducer and activator of transcription 3
LigandBDBM144580
Substrate/Competitorn/a
Meas. Tech. EMSA Based Assay
IC50 90000±n/a nM
Citation Turkson, JHamilton, AD Inhibitors of STAT3 US Patent US8969578 Publication Date 3/3/2015
 
Signal transducer and activator of transcription 3
Name:Signal transducer and activator of transcription 3
Type:Protein
Mol. Mass.:88064.31
Organism:Homo sapiens (Human)
Description:P40763
Residue:770
BDBM144580
NameBDBM144580
Synonyms:US8969578, 13
TypeSmall organic molecule
Emp. Form.C24H21N2O7P
Mol. Mass.480.4065
SMILESCOc1ccc(NC(=O)c2nc(oc2Cc2ccc(OP(O)(O)=O)cc2)-c2ccccc2)cc1