Reaction Details
TargetSignal transducer and activator of transcription 3
LigandBDBM144581
Substrate/Competitorn/a
Meas. Tech. EMSA Based Assay
IC50 28000±n/a nM
Citation Turkson, JHamilton, AD Inhibitors of STAT3 US Patent US8969578 Publication Date 3/3/2015
 
Signal transducer and activator of transcription 3
Name:Signal transducer and activator of transcription 3
Type:Protein
Mol. Mass.:88064.31
Organism:Homo sapiens (Human)
Description:P40763
Residue:770
BDBM144581
NameBDBM144581
Synonyms:US8969578, 14
TypeSmall organic molecule
Emp. Form.C24H21N2O6PS
Mol. Mass.496.472
SMILESCOc1ccc(NC(=O)c2nc(sc2Cc2ccc(OP(O)(O)=O)cc2)-c2ccccc2)cc1