Reaction Details
TargetSignal transducer and activator of transcription 3
LigandBDBM20282
Substrate/Competitorn/a
Meas. Tech. EMSA Based Assay
IC50 58000±n/a nM
Citation Turkson, JHamilton, AD Inhibitors of STAT3 US Patent US8969578 Publication Date 3/3/2015
 
Signal transducer and activator of transcription 3
Name:Signal transducer and activator of transcription 3
Type:Protein
Mol. Mass.:88064.31
Organism:Homo sapiens (Human)
Description:P40763
Residue:770
BDBM20282
NameBDBM20282
Synonyms:4-{[4-(hexylcarbamoyl)-2-(naphthalen-1-yl)-1,3-oxazol-5-yl]methyl}phenoxyphosphonic acid | S3I-M2001
TypeSmall organic molecule
Emp. Form.C27H29N2O6P
Mol. Mass.508.5027
SMILESCCCCCCNC(=O)c1nc(oc1Cc1ccc(OP(O)(O)=O)cc1)-c1cccc2ccccc12