Reaction Details
TargetSignal transducer and activator of transcription 3
LigandBDBM50396180
Substrate/Competitorn/a
Meas. Tech. EMSA Based Assay
IC50 25000±n/a nM
Citation Turkson, JHamilton, AD Inhibitors of STAT3 US Patent US8969578 Publication Date 3/3/2015
 
Signal transducer and activator of transcription 3
Name:Signal transducer and activator of transcription 3
Type:Protein
Mol. Mass.:88064.31
Organism:Homo sapiens (Human)
Description:P40763
Residue:770
BDBM50396180
NameBDBM50396180
Synonyms:CHEMBL2171897
TypeSmall organic molecule
Emp. Form.C27H29N2O5PS
Mol. Mass.524.568
SMILESCCCCCCNC(=O)c1nc(sc1Cc1ccc(OP(O)(O)=O)cc1)-c1cccc2ccccc12