Reaction Details
TargetSignal transducer and activator of transcription 3
LigandBDBM144582
Substrate/Competitorn/a
Meas. Tech. EMSA Based Assay
IC50 255000±n/a nM
Citation Turkson, JHamilton, AD Inhibitors of STAT3 US Patent US8969578 Publication Date 3/3/2015
 
Signal transducer and activator of transcription 3
Name:Signal transducer and activator of transcription 3
Type:Protein
Mol. Mass.:88064.31
Organism:Homo sapiens (Human)
Description:P40763
Residue:770
BDBM144582
NameBDBM144582
Synonyms:US8969578, 17
TypeSmall organic molecule
Emp. Form.C33H31N2O6P
Mol. Mass.582.5828
SMILESOP(O)(=O)Oc1ccc(Cc2oc(nc2C(=O)Nc2ccc(cc2)C2CCCCC2)-c2cccc3ccccc23)cc1