Reaction Details
TargetSignal transducer and activator of transcription 3
LigandBDBM144583
Substrate/Competitorn/a
Meas. Tech. EMSA Based Assay
IC50 350000±n/a nM
Citation Turkson, JHamilton, AD Inhibitors of STAT3 US Patent US8969578 Publication Date 3/3/2015
 
Signal transducer and activator of transcription 3
Name:Signal transducer and activator of transcription 3
Type:Protein
Mol. Mass.:88064.31
Organism:Homo sapiens (Human)
Description:P40763
Residue:770
BDBM144583
NameBDBM144583
Synonyms:US8969578, 18
TypeSmall organic molecule
Emp. Form.C33H31N2O5PS
Mol. Mass.598.648
SMILESOP(O)(=O)Oc1ccc(Cc2sc(nc2C(=O)Nc2ccc(cc2)C2CCCCC2)-c2cccc3ccccc23)cc1