Reaction Details
TargetSignal transducer and activator of transcription 3
LigandBDBM144584
Substrate/Competitorn/a
Meas. Tech. EMSA Based Assay
IC50 125000±n/a nM
Citation Turkson, JHamilton, AD Inhibitors of STAT3 US Patent US8969578 Publication Date 3/3/2015
 
Signal transducer and activator of transcription 3
Name:Signal transducer and activator of transcription 3
Type:Protein
Mol. Mass.:88064.31
Organism:Homo sapiens (Human)
Description:P40763
Residue:770
BDBM144584
NameBDBM144584
Synonyms:US8969578, 19
TypeSmall organic molecule
Emp. Form.C28H23N2O6PS
Mol. Mass.546.531
SMILESCOc1ccc(NC(=O)c2nc(sc2Cc2ccc(OP(O)(O)=O)cc2)-c2cccc3ccccc23)cc1