Reaction Details
TargetCytochrome P450 3A4
LigandBDBM144636
Substrate/Competitorn/a
Meas. Tech.Homogenous Time-Resolved Fluorescence Assay (HTRF)
pH7.4±n/a
Temperature298.15±n/a K
IC50 0.102±n/a nM
Commentsextracted
Citation Rew, Y Benzoic acid derivative MDM2 inhibitor for the treatment of cancer US Patent US8952036 Publication Date 2/10/2015
 
Cytochrome P450 3A4
Name:Cytochrome P450 3A4
Type:Enzyme
Mol. Mass.:57349.57
Organism:Homo sapiens (Human)
Description:n/a
Residue:503
BDBM144636
NameBDBM144636
Synonyms:US8952036, Ex. 4
TypeSmall organic molecule
Emp. Form.C29H34Cl2FNO5S
Mol. Mass.598.553
SMILESCC(C)(C)S(=O)(=O)C[C@H](C1CC1)N1[C@@H]([C@H](C[C@](C)(CC(O)=O)C1=O)c1cccc(Cl)c1)c1ccc(Cl)c(F)c1