Reaction Details
TargetCytochrome P450 3A4
LigandBDBM144638
Substrate/Competitorn/a
Meas. Tech.Homogenous Time-Resolved Fluorescence Assay (HTRF)
pH7.4±n/a
Temperature298.15±n/a K
IC50 0.33±n/a nM
Commentsextracted
Citation Rew, Y Benzoic acid derivative MDM2 inhibitor for the treatment of cancer US Patent US8952036 Publication Date 2/10/2015
 
Cytochrome P450 3A4
Name:Cytochrome P450 3A4
Type:Enzyme
Mol. Mass.:57349.57
Organism:Homo sapiens (Human)
Description:n/a
Residue:503
BDBM144638
NameBDBM144638
Synonyms:US8952036, Ex. 3
TypeSmall organic molecule
Emp. Form.C37H41Cl2FN2O7S
Mol. Mass.747.7
SMILESCOc1cc(NC(=O)C[C@@]2(C)C[C@@H]([C@H](N([C@H](CS(=O)(=O)C(C)(C)C)C3CC3)C2=O)c2ccc(Cl)c(F)c2)c2cccc(Cl)c2)ccc1C(O)=O