Reaction Details
TargetReceptor-type tyrosine-protein kinase FLT3
LigandBDBM47165
Substrate/Competitorn/a
Meas. Tech.Kinase Assay
IC50 556±n/a nM
Citation Dannhardt, GPlutizki, SGanser, CLauermann, E Conjugated 3-(indolyl)- and 3-(azaindolyl)-4-arylmaleimide compounds and their use in tumor treatment US Patent US8957103 Publication Date 2/17/2015
 
Receptor-type tyrosine-protein kinase FLT3
Name:Receptor-type tyrosine-protein kinase FLT3
Type:Enzyme
Mol. Mass.:112888.62
Organism:Homo sapiens (Human)
Description:P36888
Residue:993
BDBM47165
NameBDBM47165
Synonyms:US8957103, C1 | US9364459, I
Typen/a
Emp. Form.C24H24N2O6
Mol. Mass.436.4572
SMILESCOc1cc(cc(OC)c1OC)C1=C(C(=O)NC1=O)c1cn(CCCO)c2ccccc12