Reaction Details
TargetGlycogen synthase kinase-3 beta
LigandBDBM147463
Substrate/Competitorn/a
Meas. Tech.Kinase Assay
IC50 12±n/a nM
Citation Dannhardt, GPlutizki, SGanser, CLauermann, E Conjugated 3-(indolyl)- and 3-(azaindolyl)-4-arylmaleimide compounds and their use in tumor treatment US Patent US8957103 Publication Date 2/17/2015
 
Glycogen synthase kinase-3 beta
Name:Glycogen synthase kinase-3 beta
Type:Enzyme
Mol. Mass.:46756.38
Organism:Homo sapiens (Human)
Description:P49841
Residue:420
BDBM147463
NameBDBM147463
Synonyms:US8957103, D
TypeSmall organic molecule
Emp. Form.C29H33N3O7
Mol. Mass.535.5882
SMILESCOc1cc(cc(OC)c1OC)C1=C(C(=O)NC1=O)c1cn(CCOC(=O)C(N)CC(C)C)c2ccccc12