Reaction Details
TargetCannabinoid receptor 1
LigandBDBM286100
Substrate/Competitorn/a
Meas. Tech.Competition Displacement Assay
IC50<100±n/a nM
Citation McElroy, JFChorvat, RJ Cannabinoid receptor antagonists/inverse agonists useful for treating metabolic disorders, including obesity and diabetes US Patent US9517228 Publication Date 12/13/2016
 
Cannabinoid receptor 1
Name:Cannabinoid receptor 1
Type:G Protein-Coupled Receptor (GPCR)
Mol. Mass.:52868.96
Organism:Homo sapiens (Human)
Description:P21554
Residue:472
BDBM286100
NameBDBM286100
Synonyms:US10617673, Example 1 US9517228, Example 1 (4'S) | US9987253, Example 1
TypeSmall organic molecule
Emp. Form.C24H21Cl2N5O3S
Mol. Mass.530.426
SMILESNC(=O)CN\C(=N/S(=O)(=O)c1ccc(Cl)cc1)N1C[C@@H](C(=N1)c1ccc(Cl)cc1)c1ccccc1