Reaction Details
TargetCannabinoid receptor 1
LigandBDBM286102
Substrate/Competitorn/a
Meas. Tech.Competition Displacement Assay
IC50<100±n/a nM
Citation McElroy, JFChorvat, RJ Cannabinoid receptor antagonists/inverse agonists useful for treating metabolic disorders, including obesity and diabetes US Patent US9517228 Publication Date 12/13/2016
 
Cannabinoid receptor 1
Name:Cannabinoid receptor 1
Type:G Protein-Coupled Receptor (GPCR)
Mol. Mass.:52868.96
Organism:Homo sapiens (Human)
Description:P21554
Residue:472
BDBM286102
NameBDBM286102
Synonyms:(2S,3R)-2-((S)-3-(4-chlorophenyl)-N′-((4-chlorophenyl)sulfonyl)-4- phenyl-4,5-dihydro-1H-pyrazole-1-carboximidamido)-3-hydroxybutanamide | US9517228, Example 2 (2S,3R,4′S)
TypeSmall organic molecule
Emp. Form.C26H25Cl2N5O2S
Mol. Mass.542.48
SMILESC[C@@H](O)[C@H](N\C(=N/Sc1ccc(Cl)cc1)N1C[C@@H](C(=N1)c1ccc(Cl)cc1)c1ccccc1)C(N)=O