Reaction Details
TargetGenome polyprotein
LigandBDBM149221
Substrate/Competitorn/a
Meas. Tech.Enzyme Assay
pH7.5±n/a
Temperature298.15±n/a K
IC50 2.32±n/a nM
Commentsextracted
Citation Eastman, KJParcella, KEKadow, JF Compounds for the treatment of hepatitis C US Patent US8962651 Publication Date 2/24/2015
 
Genome polyprotein
Name:Genome polyprotein
Type:Enzyme
Mol. Mass.:326966.11
Organism:Hepatitis C virus (HCV)
Description:Q9WMX2
Residue:3010
BDBM149221
NameBDBM149221
Synonyms:US8962651, 1
TypeSmall organic molecule
Emp. Form.C30H25F4N5O4
Mol. Mass.595.5442
SMILESCNC(=O)c1c(oc2nc(CCC(F)(F)F)c(cc12)-c1cccc(c1)C(=O)NC(C)(C)c1ncon1)-c1ccc(F)cc1