Reaction Details
TargetGlutaminyl-peptide cyclotransferase
LigandBDBM149358
Substrate/Competitorn/a
Meas. Tech.Spectrophotometric Assay
Temperature303.15±n/a K
Ki 6.07±n/a nM
IC50 69.7±n/a nM
Commentsextracted
Citation Heiser, USommer, RGaertner, UHamann, AAlmstetter, MThormann, MTreml, ADemuth, HHoffman, T Inhibitors of glutaminyl cyclase US Patent US8962860 Publication Date 2/24/2015
 
Glutaminyl-peptide cyclotransferase
Name:Glutaminyl-peptide cyclotransferase
Type:Enzyme
Mol. Mass.:40877.05
Organism:Homo sapiens (Human)
Description:Q16769
Residue:361
BDBM149358
NameBDBM149358
Synonyms:US8962860, 1
TypeSmall organic molecule
Emp. Form.C16H10N6O2S
Mol. Mass.350.355
SMILESO=C1NC(=O)N(C1c1ccc2nsnc2c1)c1ccc2[nH]cnc2c1