Reaction Details
TargetSphingosine 1-phosphate receptor 2
LigandBDBM149711
Substrate/Competitorn/a
Meas. Tech.Fluorescence-Based Assay
pH7.2±n/a
Temperature310.15±n/a K
IC50 27±n/a nM
Commentsextracted
Citation Naganawa, AKusumi, KOtsuki, KSekiguchi, TKakuuchi, AShinozaki, KYamamoto, HNonaka, S Phenyl derivative US Patent US8975409 Publication Date 3/10/2015
 
Sphingosine 1-phosphate receptor 2
Name:Sphingosine 1-phosphate receptor 2
Type:Protein
Mol. Mass.:38749.58
Organism:Rattus norvegicus (Rat)
Description:P47752
Residue:352
BDBM149711
NameBDBM149711
Synonyms:US8975409, Comparative compound B
TypeSmall organic molecule
Emp. Form.C24H31FN2O3
Mol. Mass.414.5129
SMILESCCC(CC)CC1(O)CCN(CC1)C(=O)Nc1cccc(Oc2ccc(F)cc2)c1