Reaction Details
TargetSphingosine 1-phosphate receptor 2
LigandBDBM149708
Substrate/Competitorn/a
Meas. Tech.Fluorescence-Based Assay
pH7.2±n/a
Temperature310.15±n/a K
IC50 5±n/a nM
Commentsextracted
Citation Naganawa, AKusumi, KOtsuki, KSekiguchi, TKakuuchi, AShinozaki, KYamamoto, HNonaka, S Phenyl derivative US Patent US8975409 Publication Date 3/10/2015
 
Sphingosine 1-phosphate receptor 2
Name:Sphingosine 1-phosphate receptor 2
Type:Protein
Mol. Mass.:38749.58
Organism:Rattus norvegicus (Rat)
Description:P47752
Residue:352
BDBM149708
NameBDBM149708
Synonyms:US8975409, Example 15(6)
TypeSmall organic molecule
Emp. Form.C36H44FN3O6
Mol. Mass.633.7495
SMILESCCC(CC)CC1(O)CCN(CC1)C(=O)Nc1cc(Oc2ccc(F)cc2)cc(Oc2ccc(cc2)C(=O)N2CCCC(O)C2)c1