Reaction Details
TargetOpioid growth factor receptor-like protein 1
LigandBDBM150209
Substrate/Competitorn/a
Meas. Tech.Radioligand Binding Assay
pH7.4±n/a
Temperature323.15±n/a K
Ki 2323.91±n/a nM
Commentsextracted
Citation Tafesse, L Pyridonemorphinan analogs and biological activity on opioid receptors US Patent US8980906 Publication Date 3/17/2015
 
Opioid growth factor receptor-like protein 1
Name:Opioid growth factor receptor-like protein 1
Type:Protein
Mol. Mass.:51247.53
Organism:Homo sapiens (Human)
Description:Q5TC84
Residue:451
BDBM150209
NameBDBM150209
Synonyms:US8980906, 9
TypeSmall organic molecule
Emp. Form.C24H26N2O5
Mol. Mass.422.4736
SMILESOC(=O)c1cc2C[C@@]3(O)[C@H]4Cc5ccc(O)cc5[C@@]3(CCN4CC3CC3)Cc2[nH]c1=O