Reaction Details
TargetOpioid growth factor receptor-like protein 1
LigandBDBM150219
Substrate/Competitorn/a
Meas. Tech.Radioligand Binding Assay
pH7.4±n/a
Temperature323.15±n/a K
Ki 2.04±n/a nM
Commentsextracted
Citation Tafesse, L Pyridonemorphinan analogs and biological activity on opioid receptors US Patent US8980906 Publication Date 3/17/2015
 
Opioid growth factor receptor-like protein 1
Name:Opioid growth factor receptor-like protein 1
Type:Protein
Mol. Mass.:51247.53
Organism:Homo sapiens (Human)
Description:Q5TC84
Residue:451
BDBM150219
NameBDBM150219
Synonyms:US8980906, 21
TypeSmall organic molecule
Emp. Form.C26H30N4O4
Mol. Mass.462.5408
SMILESNC(=O)CNC(=O)c1cc2C[C@H]3[C@H]4Cc5ccc(O)cc5[C@@]3(CCN4CC3CC3)Cc2[nH]c1=O