Reaction Details
TargetMu-type opioid receptor
LigandBDBM150205
Substrate/Competitorn/a
Meas. Tech.Radioligand Dose-Displacement Binding Assay
pH7.4±n/a
Temperature323.15±n/a K
Ki 6.55±n/a nM
Commentsextracted
Citation Tafesse, L Pyridonemorphinan analogs and biological activity on opioid receptors US Patent US8980906 Publication Date 3/17/2015
 
Mu-type opioid receptor
Name:Mu-type opioid receptor
Type:G Protein-Coupled Receptor (GPCR)
Mol. Mass.:44789.51
Organism:Homo sapiens (Human)
Description:P35372
Residue:400
BDBM150205
NameBDBM150205
Synonyms:US8980906, 5
TypeSmall organic molecule
Emp. Form.C24H27N3O4
Mol. Mass.421.4889
SMILESNC(=O)c1cc2C[C@@]3(O)[C@H]4Cc5ccc(O)cc5[C@@]3(CCN4CC3CC3)Cc2[nH]c1=O