Reaction Details
TargetMu-type opioid receptor
LigandBDBM150222
Substrate/Competitorn/a
Meas. Tech.Radioligand Dose-Displacement Binding Assay
pH7.4±n/a
Temperature323.15±n/a K
Ki 3.95±n/a nM
Commentsextracted
Citation Tafesse, L Pyridonemorphinan analogs and biological activity on opioid receptors US Patent US8980906 Publication Date 3/17/2015
 
Mu-type opioid receptor
Name:Mu-type opioid receptor
Type:G Protein-Coupled Receptor (GPCR)
Mol. Mass.:44789.51
Organism:Homo sapiens (Human)
Description:P35372
Residue:400
BDBM150222
NameBDBM150222
Synonyms:US8980906, 24
TypeSmall organic molecule
Emp. Form.C30H38N4O4
Mol. Mass.518.6471
SMILESCC(C)C[C@H](NC(=O)c1cc2C[C@H]3[C@H]4Cc5ccc(O)cc5[C@@]3(CCN4CC3CC3)Cc2[nH]c1=O)C(N)=O