Reaction Details
TargetMu-type opioid receptor
LigandBDBM150226
Substrate/Competitorn/a
Meas. Tech.Radioligand Dose-Displacement Binding Assay
pH7.4±n/a
Temperature323.15±n/a K
Ki 14367.18±n/a nM
Commentsextracted
Citation Tafesse, L Pyridonemorphinan analogs and biological activity on opioid receptors US Patent US8980906 Publication Date 3/17/2015
 
Mu-type opioid receptor
Name:Mu-type opioid receptor
Type:G Protein-Coupled Receptor (GPCR)
Mol. Mass.:44789.51
Organism:Homo sapiens (Human)
Description:P35372
Residue:400
BDBM150226
NameBDBM150226
Synonyms:US8980906, 28
TypeSmall organic molecule
Emp. Form.C22H25N3O4
Mol. Mass.395.4516
SMILESCOc1ccc2C[C@H]3N(C)CC[C@@]4(Cc5[nH]c(=O)c(cc5C[C@@]34O)C(N)=O)c2c1