Reaction Details
TargetMu-type opioid receptor
LigandBDBM150227
Substrate/Competitorn/a
Meas. Tech.Radioligand Dose-Displacement Binding Assay
pH7.4±n/a
Temperature323.15±n/a K
Ki 651.45±n/a nM
Commentsextracted
Citation Tafesse, L Pyridonemorphinan analogs and biological activity on opioid receptors US Patent US8980906 Publication Date 3/17/2015
 
Mu-type opioid receptor
Name:Mu-type opioid receptor
Type:G Protein-Coupled Receptor (GPCR)
Mol. Mass.:44789.51
Organism:Homo sapiens (Human)
Description:P35372
Residue:400
BDBM150227
NameBDBM150227
Synonyms:US8980906, 29
TypeSmall organic molecule
Emp. Form.C21H23N3O4
Mol. Mass.381.425
SMILESCN1CC[C@]23Cc4[nH]c(=O)c(cc4C[C@@]2(O)[C@H]1Cc1ccc(O)cc31)C(N)=O