Reaction Details
TargetKappa-type opioid receptor
LigandBDBM150203
Substrate/Competitorn/a
Meas. Tech.Radioligand Dose-Displacement Binding Assay
pH7.4±n/a
Ki 3.85±n/a nM
Commentsextracted
Citation Tafesse, L Pyridonemorphinan analogs and biological activity on opioid receptors US Patent US8980906 Publication Date 3/17/2015
 
Kappa-type opioid receptor
Name:Kappa-type opioid receptor
Type:G Protein-Coupled Receptor (GPCR)
Mol. Mass.:42648.76
Organism:Homo sapiens (Human)
Description:P41145
Residue:380
BDBM150203
NameBDBM150203
Synonyms:US8980906, 3
TypeSmall organic molecule
Emp. Form.C26H30N2O4
Mol. Mass.434.5274
SMILESCOC(=O)c1cc2C[C@H]3[C@H]4Cc5ccc(OC)cc5[C@@]3(CCN4CC3CC3)Cc2[nH]c1=O