Reaction Details
TargetKappa-type opioid receptor
LigandBDBM150204
Substrate/Competitorn/a
Meas. Tech.Radioligand Dose-Displacement Binding Assay
pH7.4±n/a
Ki 728.34±n/a nM
Commentsextracted
Citation Tafesse, L Pyridonemorphinan analogs and biological activity on opioid receptors US Patent US8980906 Publication Date 3/17/2015
 
Kappa-type opioid receptor
Name:Kappa-type opioid receptor
Type:G Protein-Coupled Receptor (GPCR)
Mol. Mass.:42648.76
Organism:Homo sapiens (Human)
Description:P41145
Residue:380
BDBM150204
NameBDBM150204
Synonyms:US8980906, 4 | US8980906, 8
TypeSmall organic molecule
Emp. Form.C25H29N3O4
Mol. Mass.435.5155
SMILESCOc1ccc2C[C@H]3N(CC4CC4)CC[C@@]4(Cc5[nH]c(=O)c(cc5C[C@@]34O)C(N)=O)c2c1