Reaction Details
TargetCarbonic anhydrase 2
LigandBDBM150255
Substrate/Competitorn/a
Meas. Tech.Inhibition Assay
pH7.5±n/a
Ki 37±n/a nM
Commentsextracted
Citation Lambin, PWinum, JSupuran, C Cancer targeting using carbonic anhydrase isoform IX inhibitors US Patent US8980932 Publication Date 3/17/2015
 
Carbonic anhydrase 2
Name:Carbonic anhydrase 2
Type:Enzyme
Mol. Mass.:29250.71
Organism:Homo sapiens (Human)
Description:P00918
Residue:260
BDBM150255
NameBDBM150255
Synonyms:US8980932, 4b (DH304)
TypeSmall organic molecule
Emp. Form.C12H13N5O5S
Mol. Mass.339.327
SMILESNS(=O)(=O)c1ccc(CNC(=O)Cn2ccnc2[N+]([O-])=O)cc1