Reaction Details
TargetCarbonic anhydrase 9
LigandBDBM150248
Substrate/Competitorn/a
Meas. Tech.Inhibition Assay
pH7.5±n/a
Ki 20.4±n/a nM
Commentsextracted
Citation Lambin, PWinum, JSupuran, C Cancer targeting using carbonic anhydrase isoform IX inhibitors US Patent US8980932 Publication Date 3/17/2015
 
Carbonic anhydrase 9
Name:Carbonic anhydrase 9
Type:Enzyme
Mol. Mass.:49669.03
Organism:Homo sapiens (Human)
Description:Catalytic domain of human cloned isozyme was used in the assay
Residue:459
BDBM150248
NameBDBM150248
Synonyms:US8980932, 7 (DH348)
TypeSmall organic molecule
Emp. Form.C6H11N5O5S
Mol. Mass.265.247
SMILESCc1ncc(n1CCNS(=O)(=O)ON)[N+]([O-])=O