Reaction Details
TargetCarbonic anhydrase 9
LigandBDBM150251
Substrate/Competitorn/a
Meas. Tech.Inhibition Assay
pH7.5±n/a
Ki 8.3±n/a nM
Commentsextracted
Citation Lambin, PWinum, JSupuran, C Cancer targeting using carbonic anhydrase isoform IX inhibitors US Patent US8980932 Publication Date 3/17/2015
 
Carbonic anhydrase 9
Name:Carbonic anhydrase 9
Type:Enzyme
Mol. Mass.:49669.03
Organism:Homo sapiens (Human)
Description:Catalytic domain of human cloned isozyme was used in the assay
Residue:459
BDBM150251
NameBDBM150251
Synonyms:US8980932, 6c (DH310)
TypeSmall organic molecule
Emp. Form.C15H20N6O4S2
Mol. Mass.412.487
SMILESCc1ncc(n1CCNC(=S)NCCc1ccc(cc1)S(N)(=O)=O)[N+]([O-])=O