Reaction Details
TargetSerine/threonine-protein kinase PAK 5
LigandBDBM150751
Substrate/Competitorn/a
Meas. Tech.DAPK1 Electrophoretic Mobility Shift Assay
pH7.5±n/a
Temperature298.15±n/a K
IC50 5.6e+3±n/a nM
Commentsextracted
Citation Wilbek, TSSkovgaard, TSorrell, FJKnapp, SBerthelsen, JStrømgaard, K Identification and characterization of a small-molecule inhibitor of death-associated protein kinase 1. Chembiochem16:59-63 (2015) 
 
Serine/threonine-protein kinase PAK 5
Name:Serine/threonine-protein kinase PAK 5
Type:Protein
Mol. Mass.:80760.58
Organism:Homo sapiens (Human)
Description:Q9P286
Residue:719
BDBM150751
NameBDBM150751
Synonyms:CPR005231 (6)
TypeSmall organic molecule
Emp. Form.C25H26N4O3
Mol. Mass.430.4989
SMILESCOc1cc(ccc1O)-c1ccc2ccc(-c3cccc(c3)C(=O)NCCN(C)C)n2n1